Target
Alpha-1B adrenergic receptor
Ligand
BDBM85833
Substrate
Ki
104.71±n/a nM
Comments
PDSP_2446
Citation
 Corradetti, RMlinar, BFalsini, CPugliese, AMCilia, ADestefani, CTesta, R Differential effects of the 5-hydroxytryptamine (5-HT)1A receptor inverse agonists Rec 27/0224 and Rec 27/0074 on electrophysiological responses to 5-HT1A receptor activation in rat dorsal raphe nucleus and hippocampus in vitro. J Pharmacol Exp Ther 315:109-17 (2005)  
Target
Name:
Alpha-1B adrenergic receptor
Synonyms:
ADA1B_HUMAN Adrenergic alpha1B Adrenergic receptor alpha Alpha 1B-adrenoreceptor | Alpha-1B adrenergic receptor
Type:
Enzyme
Mol. Mass.:
56862.13
Organism:
Homo sapiens (Human)
Description:
P35368
Residue:
520
  
Inhibitor
Name:
BDBM85833
Synonyms:
N-[2-[4-(2-methoxyphenyl)-1-piperazinyl]- ethyl]-N-(2-nitrophenyl)cyclohexanecarboxamide | Rec 15/3079
Type:
Small organic molecule
Emp. Form.:
C26H34N4O4
Mol. Mass.:
466.5726
SMILES:
COc1ccccc1N1CCN(CCN(C(=O)C2CCCCC2)c2ccccc2[N+]([O-])=O)CC1
: