Target
Excitatory amino acid transporter 1
Ligand
BDBM86714
Substrate
Ki
3426±n/a nM
Comments
PDSP_6775
Citation
 Dunlop, JMcIlvain, HBCarrick, TAJow, BLu, QKowal, DLin, SGreenfield, AGrosanu, CFan, KPetroski, RWilliams, JFoster, AButera, J Characterization of novel aryl-ether, biaryl, and fluorene aspartic acid and diaminopropionic acid analogs as potent inhibitors of the high-affinity glutamate transporter EAAT2. Mol Pharmacol 68:974-82 (2005)  
Target
Name:
Excitatory amino acid transporter 1
Synonyms:
EAA1_HUMAN Excitatory Amino Acid EAAT1 GLAST1 | SLC1A3
Type:
Enzyme Catalytic Domain
Mol. Mass.:
59577.19
Organism:
Homo sapiens (Human)
Description:
Excitatory Amino Acid EAAT1 0 HUMAN::P43003
Residue:
542
  
Inhibitor
Name:
BDBM86714
Synonyms:
WAY 212922 | WAY-212922
Type:
Small organic molecule
Emp. Form.:
C18H15F3N2O3
Mol. Mass.:
364.3185
SMILES:
N[C@@H](CC(=O)Nc1ccc-2c(Cc3cc(ccc-23)C(F)(F)F)c1)C(O)=O
: