Target
D(3) dopamine receptor
Ligand
BDBM86724
Substrate
Ki
18±n/a nM
Comments
PDSP_5079
Citation
 Burstein, ESMa, JWong, SGao, YPham, EKnapp, AENash, NROlsson, RDavis, REHacksell, UWeiner, DMBrann, MR Intrinsic efficacy of antipsychotics at human D2, D3, and D4 dopamine receptors: identification of the clozapine metabolite N-desmethylclozapine as a D2/D3 partial agonist. J Pharmacol Exp Ther 315:1278-87 (2005)  
Target
Name:
D(3) dopamine receptor
Synonyms:
DOPAMINE D3 DRD3_HUMAN Dopamine D3 receptor (D3) Dopamine receptor Dopamine receptor D3
Type:
Mol. Mass.:
44243.43
Organism:
Homo sapiens (Human)
Description:
Residue:
400
  
Inhibitor
Name:
BDBM86724
Synonyms:
CAS_84-01-5 chlorproethazine
Type:
Small organic molecule
Emp. Form.:
C19H23ClN2S
Mol. Mass.:
346.917
SMILES:
CCN(CC)CCCN1c2ccccc2Sc2ccc(Cl)cc12
: