Target
cGMP-dependent protein kinase 1
Ligand
BDBM15211
Substrate
Ki
500±n/a nM
Comments
PDSP_6135
Citation
 Braverman, ASTibb, ASRuggieri, MR M2 and M3 muscarinic receptor activation of urinary bladder contractile signal transduction. I. Normal rat bladder. J Pharmacol Exp Ther 316:869-74 (2006)  
Target
Name:
cGMP-dependent protein kinase 1
Synonyms:
GMP-dependent protein kinase I PRKG1 PRKGR1A Protein Kinase G cGMP-dependent protein kinase 1 | cGMP-dependent protein kinase 1 beta
Type:
Protein
Mol. Mass.:
76358.04
Organism:
Homo sapiens (Human)
Description:
Q13976
Residue:
671
  
Inhibitor
Name:
BDBM15211
Synonyms:
CHEMBL104264 H89 N-(2-{[(2E)-3-(4-bromophenyl)prop-2-en-1-yl]amino}ethyl)isoquinoline-5-sulfonamide | N-[2-[[(E)-3-(4-bromophenyl)prop-2-enyl]amino]ethyl]isoquinoline-5-sulfonamide
Type:
Small organic molecule
Emp. Form.:
C20H20BrN3O2S
Mol. Mass.:
446.361
SMILES:
Brc1ccc(\C=C\CNCCNS(=O)(=O)c2cccc3cnccc23)cc1
: