Target
Alpha-1A adrenergic receptor
Ligand
BDBM50160152
Substrate
Ki
1±n/a nM
Comments
PDSP_6218
Citation
 Kinsella, GKRozas, IWatson, GW Computational study of antagonist/alpha1A adrenoceptor complexes--observations of conformational variations on the formation of ligand/receptor complexes. J Med Chem 49:501-10 (2006)  
Target
Name:
Alpha-1A adrenergic receptor
Synonyms:
ADA1A_HUMAN ADRA1C Alpha 1A-adrenoceptor Alpha adrenergic receptor 1a Alpha-adrenergic receptor 1c adrenergic Alpha1 | adrenergic Alpha1C
Type:
Cell-surface receptors
Mol. Mass.:
51511.67
Organism:
Homo sapiens (Human)
Description:
P35348
Residue:
466
  
Inhibitor
Name:
BDBM50160152
Synonyms:
3-(3-{3-[4-Fluoro-2-(2,2,2-trifluoro-ethoxy)-phenyl]-piperazin-1-yl}-propyl)-5-methyl-1H-pyrimidine-2,4-dione CHEMBL24777 Ro-700004
Type:
Small organic molecule
Emp. Form.:
C20H24F4N4O3
Mol. Mass.:
444.4232
SMILES:
Cc1c[nH]c(=O)n(CCCN2CCN(CC2)c2ccc(F)cc2OCC(F)(F)F)c1=O
: