Target
Histamine H1 receptor
Ligand
BDBM86742
Substrate
Ki
990±n/a nM
Comments
PDSP_6454
Citation
 Xie, SXKraus, AGhorai, PYe, QZElz, SBuschauer, ASeifert, R N1-(3-cyclohexylbutanoyl)-N2-[3-(1H-imidazol-4-yl)propyl]guanidine (UR-AK57), a potent partial agonist for the human histamine H1- and H2-receptors. J Pharmacol Exp Ther 317:1262-8 (2006)  
Target
Name:
Histamine H1 receptor
Synonyms:
H1R HISTAMINE H1 HRH1_HUMAN
Type:
G Protein-Coupled Receptor (GPCR)
Mol. Mass.:
55808.72
Organism:
Homo sapiens (Human)
Description:
Cell pellets from SK-N-MC cells transfected with human H1 receptor were used in binding assay.
Residue:
487
  
Inhibitor
Name:
BDBM86742
Synonyms:
UR-AK64
Type:
Small organic molecule
Emp. Form.:
C17H29N5O
Mol. Mass.:
319.4451
SMILES:
NC(NC(=O)CCCC1CCCCC1)=NCCCc1cnc[nH]1
: