Target
Glutamate receptor ionotropic, kainate 5
Ligand
BDBM50168962
Substrate
Ki
4000±n/a nM
Comments
PDSP_6661
Citation
 Weiss, BAlt, AOgden, AMGates, MDieckman, DKClemens-Smith, AHo, KHJarvie, KRizkalla, GWright, RACalligaro, DOSchoepp, DMattiuz, ELStratford, REJohnson, BSalhoff, CKatofiasc, MPhebus, LASchenck, KCohen, MFilla, SAOrnstein, PLJohnson, KWBleakman, D Pharmacological characterization of the competitive GLUK5 receptor antagonist decahydroisoquinoline LY466195 in vitro and in vivo. J Pharmacol Exp Ther 318:772-81 (2006)  
Target
Name:
Glutamate receptor ionotropic, kainate 5
Synonyms:
GRIK2 GRIK5_HUMAN Glutamate receptor, ionotropic kainate 5 Ionotropic glutamate receptor kainate 2/5
Type:
Enzyme Catalytic Domain
Mol. Mass.:
109280.81
Organism:
Homo sapiens (Human)
Description:
Glutamate-Kainate 5 Grik5 HUMAN::Q16478
Residue:
980
  
Inhibitor
Name:
BDBM50168962
Synonyms:
(3S,4aR,6S,8aR)-6-(4-Carboxy-benzyl)-decahydro-isoquinoline-3-carboxylic acid CHEMBL274226 | LY 382884
Type:
Small organic molecule
Emp. Form.:
C18H23NO4
Mol. Mass.:
317.3795
SMILES:
OC(=O)[C@@H]1C[C@H]2C[C@@H](Cc3ccc(cc3)C(O)=O)CC[C@H]2CN1
: