Target
5-hydroxytryptamine receptor 2C
Ligand
BDBM86708
Substrate
Ki
>10000±n/a nM
Comments
PDSP_1954
Citation
 Chemel, BRRoth, BLArmbruster, BWatts, VJNichols, DE WAY-100635 is a potent dopamine D4 receptor agonist. Psychopharmacology (Berl) 188:244-51 (2006)  
Target
Name:
5-hydroxytryptamine receptor 2C
Synonyms:
5-HT2C 5-hydroxytryptamine receptor 2C (5HT2c) 5ht1c Htr2c Serotonin receptor 2a and 2c (5HT2A and 5HT2C)
Type:
Enzyme
Mol. Mass.:
51935.10
Organism:
Rattus norvegicus (Rat)
Description:
P08909
Residue:
460
  
Inhibitor
Name:
BDBM86708
Synonyms:
CAS_146714-97-8 CHEMBL514874 NSC_104911 | WAY 100,635
Type:
Small organic molecule
Emp. Form.:
C25H34N4O2
Mol. Mass.:
422.5631
SMILES:
COc1ccccc1N1CCN(CCN(C(=O)C2CCCCC2)c2ccccn2)CC1
: