Target
Sodium-dependent noradrenaline transporter
Ligand
BDBM86757
Substrate
Ki
>10000±n/a nM
Comments
PDSP_7627
Citation
 Kumar, JSPrabhakaran, JMajo, VJMilak, MSHsiung, SCTamir, HSimpson, NRVan Heertum, RLMann, JJParsey, RV Synthesis and in vivo evaluation of a novel 5-HT1A receptor agonist radioligand [O-methyl- 11C]2-(4-(4-(2-methoxyphenyl)piperazin-1-yl)butyl)-4-methyl-1,2,4-triazine-3,5(2H,4H)dione in nonhuman primates. Eur J Nucl Med Mol Imaging 34:1050-60 (2007)  
Target
Name:
Sodium-dependent noradrenaline transporter
Synonyms:
NORADR SC6A2_BOVIN Sodium-dependent noradrenaline transporter
Type:
Enzyme Catalytic Domain
Mol. Mass.:
68909.35
Organism:
BOVINE
Description:
Norepinephrine transporter 0 BOVINE::P51143
Residue:
615
  
Inhibitor
Name:
BDBM86757
Synonyms:
CAS_0 [11C]MMP
Type:
Small organic molecule
Emp. Form.:
C19H27N5O3
Mol. Mass.:
373.4494
SMILES:
COc1ccccc1N1CCN(CCCCn2ncc(=O)n(C)c2=O)CC1
: