Target
D(2) dopamine receptor
Ligand
BDBM86850
Substrate
Ki
0.69±n/a nM
Comments
PDSP_8537
Citation
 Chiu, GLi, SConnolly, PJPulito, VLiu, JMiddleton, SA (Phenylpiperazinyl)cyclohexylureas: discovery of alpha1a/1d-selective adrenergic receptor antagonists for the treatment of benign prostatic hyperplasia/lower urinary tract symptoms (BPH/LUTS). Bioorg Med Chem Lett 18:640-4 (2008)  
Target
Name:
D(2) dopamine receptor
Synonyms:
D(2) dopamine receptor DOPAMINE D2 Long DRD2 Dopamine D2 receptor Dopamine D2 receptor (D2R) Dopamine2-like | d2
Type:
Cell-surface receptors
Mol. Mass.:
50647.10
Organism:
Homo sapiens (Human)
Description:
P14416
Residue:
443
  
Inhibitor
Name:
BDBM86850
Synonyms:
1-(2,4-difluorophenyl)-3-(4-(4-(2-isopropoxyphenyl)piperazin-1-yl)cyclohexyl)urea NSC_16041628
Type:
Small organic molecule
Emp. Form.:
C26H34F2N4O2
Mol. Mass.:
472.5706
SMILES:
CC(C)Oc1ccccc1N1CCN(CC1)C1CCC(CC1)NC(=O)Nc1ccc(F)cc1F
: