Target
Cannabinoid receptor 1
Ligand
BDBM86995
Substrate
Ki
4±n/a nM
Comments
PDSP_8479
Citation
 Alig, LAlsenz, JAndjelkovic, MBendels, SBénardeau, ABleicher, KBourson, ADavid-Pierson, PGuba, WHildbrand, SKube, DLübbers, TMayweg, AVNarquizian, RNeidhart, WNettekoven, MPlancher, JMRocha, CRogers-Evans, MRöver, SSchneider, GTaylor, SWaldmeier, P Benzodioxoles: novel cannabinoid-1 receptor inverse agonists for the treatment of obesity. J Med Chem 51:2115-27 (2008)  
Target
Name:
Cannabinoid receptor 1
Synonyms:
CANN6 CB-R CNR CNR1_HUMAN Cannabinoid receptor Cannabinoid receptor 1 (brain)
Type:
G Protein-Coupled Receptor (GPCR)
Mol. Mass.:
52868.96
Organism:
Homo sapiens (Human)
Description:
P21554
Residue:
472
  
Inhibitor
Name:
BDBM86995
Synonyms:
(2-(2,4-dichlorophenyl)-6-fluoro-2-(2-fluorophenyl)benzo[d][1,3]dioxol-5-yl)(morpholino)methanone NSC_24828287
Type:
Small organic molecule
Emp. Form.:
C24H17Cl2F2NO4
Mol. Mass.:
492.299
SMILES:
Fc1ccccc1C1(Oc2cc(F)c(cc2O1)C(=O)N1CCOCC1)c1ccc(Cl)cc1Cl
: