Target
Sodium-dependent serotonin transporter
Ligand
BDBM87028
Substrate
Ki
30±n/a nM
Comments
PDSP_8616
Citation
 Fish, PVDeur, CGan, XGreene, KHoople, DMackenny, MPara, KSReeves, KRyckmans, TStiff, CStobie, AWakenhut, FWhitlock, GA Design and synthesis of morpholine derivatives. SAR for dual serotonin & noradrenaline reuptake inhibition. Bioorg Med Chem Lett 18:2562-6 (2008)  
Target
Name:
Sodium-dependent serotonin transporter
Synonyms:
5-HT Transporter 5HTT SC6A4_HUMAN SLC6A4 Serotonin transporter (5HTT) Sodium-dependent serotonin transporter (SERT) | Solute carrier family 6 member 4
Type:
Multi-pass membrane protein
Mol. Mass.:
70322.51
Organism:
Homo sapiens (Human)
Description:
P31645
Residue:
630
  
Inhibitor
Name:
BDBM87028
Synonyms:
(S)-2-((S)-(4-bromo-2-methoxyphenoxy)(phenyl)methyl)morpholine NSC_44450153
Type:
Small organic molecule
Emp. Form.:
C18H20BrNO3
Mol. Mass.:
378.26
SMILES:
COc1cc(Br)ccc1OC(C1CNCCO1)c1ccccc1
: