Target
Sodium-dependent serotonin transporter
Ligand
BDBM87037
Substrate
Ki
58±n/a nM
Comments
PDSP_8612
Citation
 Fish, PVDeur, CGan, XGreene, KHoople, DMackenny, MPara, KSReeves, KRyckmans, TStiff, CStobie, AWakenhut, FWhitlock, GA Design and synthesis of morpholine derivatives. SAR for dual serotonin & noradrenaline reuptake inhibition. Bioorg Med Chem Lett 18:2562-6 (2008)  
Target
Name:
Sodium-dependent serotonin transporter
Synonyms:
5-HT Transporter 5HTT SC6A4_HUMAN SLC6A4 Serotonin transporter (5HTT) Sodium-dependent serotonin transporter (SERT) | Solute carrier family 6 member 4
Type:
Multi-pass membrane protein
Mol. Mass.:
70322.51
Organism:
Homo sapiens (Human)
Description:
P31645
Residue:
630
  
Inhibitor
Name:
BDBM87037
Synonyms:
(S)-2-((S)-(4-chloro-2-methoxyphenoxy)(3-fluorophenyl)methyl)morpholine NSC_44450119
Type:
Small organic molecule
Emp. Form.:
C18H19ClFNO3
Mol. Mass.:
351.8
SMILES:
COc1cc(Cl)ccc1OC(C1CNCCO1)c1cccc(F)c1
: