Target
Sodium-dependent dopamine transporter
Ligand
BDBM87033
Substrate
Ki
>10000±n/a nM
Comments
PDSP_8633
Citation
 Fish, PVDeur, CGan, XGreene, KHoople, DMackenny, MPara, KSReeves, KRyckmans, TStiff, CStobie, AWakenhut, FWhitlock, GA Design and synthesis of morpholine derivatives. SAR for dual serotonin & noradrenaline reuptake inhibition. Bioorg Med Chem Lett 18:2562-6 (2008)  
Target
Name:
Sodium-dependent dopamine transporter
Synonyms:
DA transporter DAT1 Dopamine transporter protein (DAT) SC6A3_HUMAN Sodium-dependent dopamine transporter Solute carrier family 6 member 3
Type:
Multi-pass membrane protein
Mol. Mass.:
68497.11
Organism:
Homo sapiens (Human)
Description:
Q01959
Residue:
620
  
Inhibitor
Name:
BDBM87033
Synonyms:
CAS_44449944 rac-syn-2-((3-chloro-2-ethoxyphenoxy)(phenyl)methyl)morpholine
Type:
Small organic molecule
Emp. Form.:
C19H22ClNO3
Mol. Mass.:
347.836
SMILES:
CCOc1c(Cl)cccc1OC(C1CNCCO1)c1ccccc1
: