Target
Histamine H1 receptor
Ligand
BDBM87027
Substrate
Ki
10±n/a nM
Comments
PDSP_8621
Citation
 Fish, PVDeur, CGan, XGreene, KHoople, DMackenny, MPara, KSReeves, KRyckmans, TStiff, CStobie, AWakenhut, FWhitlock, GA Design and synthesis of morpholine derivatives. SAR for dual serotonin & noradrenaline reuptake inhibition. Bioorg Med Chem Lett 18:2562-6 (2008)  
Target
Name:
Histamine H1 receptor
Synonyms:
H1R HISTAMINE H1 HRH1_HUMAN
Type:
G Protein-Coupled Receptor (GPCR)
Mol. Mass.:
55808.72
Organism:
Homo sapiens (Human)
Description:
Cell pellets from SK-N-MC cells transfected with human H1 receptor were used in binding assay.
Residue:
487
  
Inhibitor
Name:
BDBM87027
Synonyms:
(R)-2-((R)-(2,3-difluorophenoxy)(phenyl)methyl)morpholine CAS_44450181 NSC_44450181 | NSC_44450185
Type:
Small organic molecule
Emp. Form.:
C17H17F2NO2
Mol. Mass.:
305.3192
SMILES:
Fc1cccc(OC(C2CNCCO2)c2ccccc2)c1F
: