Target
Sodium-dependent noradrenaline transporter
Ligand
BDBM87027
Substrate
Ki
10±n/a nM
Comments
PDSP_8622
Citation
 Fish, PVDeur, CGan, XGreene, KHoople, DMackenny, MPara, KSReeves, KRyckmans, TStiff, CStobie, AWakenhut, FWhitlock, GA Design and synthesis of morpholine derivatives. SAR for dual serotonin & noradrenaline reuptake inhibition. Bioorg Med Chem Lett 18:2562-6 (2008)  
Target
Name:
Sodium-dependent noradrenaline transporter
Synonyms:
Monoamine transporter NET Noradrenaline Transporter (NET) Norepinephrine transporter protein (NET) SLC6A2 Sodium-dependent noradrenaline transporter (NET) | Solute carrier family 6 member 2
Type:
Multi-pass membrane protein
Mol. Mass.:
69337.72
Organism:
Homo sapiens (Human)
Description:
P23975
Residue:
617
  
Inhibitor
Name:
BDBM87027
Synonyms:
(R)-2-((R)-(2,3-difluorophenoxy)(phenyl)methyl)morpholine CAS_44450181 NSC_44450181 | NSC_44450185
Type:
Small organic molecule
Emp. Form.:
C17H17F2NO2
Mol. Mass.:
305.3192
SMILES:
Fc1cccc(OC(C2CNCCO2)c2ccccc2)c1F
: