Target
Sodium-dependent noradrenaline transporter
Ligand
BDBM87032
Substrate
Ki
12±n/a nM
Comments
PDSP_8626
Citation
 Fish, PVDeur, CGan, XGreene, KHoople, DMackenny, MPara, KSReeves, KRyckmans, TStiff, CStobie, AWakenhut, FWhitlock, GA Design and synthesis of morpholine derivatives. SAR for dual serotonin & noradrenaline reuptake inhibition. Bioorg Med Chem Lett 18:2562-6 (2008)  
Target
Name:
Sodium-dependent noradrenaline transporter
Synonyms:
Monoamine transporter NET Noradrenaline Transporter (NET) Norepinephrine transporter protein (NET) SLC6A2 Sodium-dependent noradrenaline transporter (NET) | Solute carrier family 6 member 2
Type:
Multi-pass membrane protein
Mol. Mass.:
69337.72
Organism:
Homo sapiens (Human)
Description:
P23975
Residue:
617
  
Inhibitor
Name:
BDBM87032
Synonyms:
(R)-2-((R)-(2-chloro-4-fluorophenoxy)(phenyl)methyl)morpholine CAS_44450211 NSC_44450211 | NSC_44450212
Type:
Small organic molecule
Emp. Form.:
C17H17ClFNO2
Mol. Mass.:
321.774
SMILES:
Fc1ccc(OC(C2CNCCO2)c2ccccc2)c(Cl)c1
: