Target
Phospholipase D1
Ligand
BDBM50258179
Substrate
Meas. Tech.
Cellular PLD1 concentration response
IC50
4±n/a nM
Citation
 PubChem, PC Cellular PLD1 concentration response PubChem Bioassay (2011)[AID] 
Target
Name:
Phospholipase D1
Synonyms:
Choline phosphatase 1 PLD1 Phosphatidylcholine-hydrolyzing phospholipase D1 Phospholipase D1 Phospholipase D2 (PLD2) | hPLD1
Type:
Protein
Mol. Mass.:
124219.92
Organism:
Homo sapiens (Human)
Description:
Q13393
Residue:
1074
  
Inhibitor
Name:
BDBM50258179
Synonyms:
CHEMBL521990 cid_21428895
Type:
Small organic molecule
Emp. Form.:
C21H22BrFN4O2
Mol. Mass.:
461.327
SMILES:
Fc1ccc(cc1)C(=O)NCCN1CCC(CC1)n1c2ccc(Br)cc2[nH]c1=O
: