Target
Nuclear receptor coactivator 3
Ligand
BDBM87355
Substrate
Meas. Tech.
Luminescence-based cell-based high throughput dose response assay for inhibitors of the Steroid Receptor Coactivator 3 (SRC3; NCOA3)
IC50
2899±n/a nM
Citation
 PubChem, PC Luminescence-based cell-based high throughput dose response assay for inhibitors of the Steroid Receptor Coactivator 3 (SRC3; NCOA3) PubChem Bioassay (2012)[AID] 
Target
Name:
Nuclear receptor coactivator 3
Synonyms:
AIB1 NCOA3 RAC3 nuclear receptor coactivator 3 isoform a
Type:
Enzyme Catalytic Domain
Mol. Mass.:
155305.29
Organism:
Homo sapiens (Human)
Description:
Q9Y6Q9
Residue:
1424
  
Inhibitor
Name:
BDBM87355
Synonyms:
2-keto-1H-pyridine-3-carboxylic acid [2-keto-2-(4-piperidinoanilino)ethyl] ester MLS002245252 [2-oxidanylidene-2-[(4-piperidin-1-ylphenyl)amino]ethyl] 2-oxidanylidene-1H-pyridine-3-carboxylate cid_2397406
Type:
Small organic molecule
Emp. Form.:
C19H21N3O4
Mol. Mass.:
355.3877
SMILES:
O=C(COC(=O)c1ccc[nH]c1=O)Nc1ccc(cc1)N1CCCCC1
: