Target
Tegument protein VP16
Ligand
BDBM65144
Substrate
Meas. Tech.
Counterscreen for inhibitors of the Steroid Receptor Coactivator 3 (SRC3; NCOA3)
IC50
6451±n/a nM
Citation
 PubChem, PC Counterscreen for inhibitors of the Steroid Receptor Coactivator 3 (SRC3; NCOA3): Luminescence-based cell-based high throughput dose response assay to identify inhibitors of the Herpes Virus Virion Protein 16 (VP16) PubChem Bioassay (2012)[AID] 
Target
Name:
Tegument protein VP16
Synonyms:
Alpha trans-inducing protein (VP16) transactivating tegument protein VP16
Type:
PROTEIN
Mol. Mass.:
54325.13
Organism:
Human herpesvirus 1 (strain 17) (HHV-1) (Human herpes simplex virus1)
Description:
EBI_100271
Residue:
490
  
Inhibitor
Name:
BDBM65144
Synonyms:
(6E)-2-methoxy-6-[[2-[6-(3-methyl-5-phenyl-pyrazol-1-yl)pyrimidin-4-yl]hydrazinyl]methylidene]cyclohexa-2,4-dien-1-one (6E)-2-methoxy-6-[[N'-[6-(3-methyl-5-phenyl-pyrazol-1-yl)pyrimidin-4-yl]hydrazino]methylene]cyclohexa-2,4-dien-1-one 2-Methoxy-6-{[6-(3-methyl-5-phenyl-pyrazol-1-yl)-pyrimidin-4-yl]-hydrazonomethyl}-phenol SMR000171989 | cid_5764239
Type:
Small organic molecule
Emp. Form.:
C22H20N6O2
Mol. Mass.:
400.4332
SMILES:
COc1cccc(CN=Nc2cc(ncn2)-n2nc(C)cc2-c2ccccc2)c1O
: