Target
Nuclear receptor coactivator 1
Ligand
BDBM87278
Substrate
Meas. Tech.
Counterscreen for inhibitors of the Steroid Receptor Coactivator 3 (SRC3; NCOA3)
IC50
>3985±n/a nM
Citation
 PubChem, PC Counterscreen for inhibitors of the Steroid Receptor Coactivator 3 (SRC3; NCOA3): Luminescence-based cell-based high throughput dose response assay to identify inhibitors of the Steroid Receptor Coactivator 1 (SRC1; NCOA1) PubChem Bioassay (2012)[AID] 
Target
Name:
Nuclear receptor coactivator 1
Synonyms:
BHLHE74 NCOA1 NCoA-1 Protein Hin-2 Renal carcinoma antigen NY-REN-52 SRC1 nuclear receptor coactivator 1 isoform 1
Type:
PROTEIN
Mol. Mass.:
156749.34
Organism:
Homo sapiens (Human)
Description:
ChEMBL_759690
Residue:
1441
  
Inhibitor
Name:
BDBM87278
Synonyms:
5-Bromo-nicotinic acid [1-(5-nitro-thiophen-2-yl)-meth-(Z)-ylidene]-hydrazide 5-bromo-N-[(Z)-(5-nitro-2-thienyl)methyleneamino]nicotinamide 5-bromo-N-[(Z)-(5-nitrothiophen-2-yl)methylideneamino]pyridine-3-carboxamide SMR000218360 | cid_5613214
Type:
Small organic molecule
Emp. Form.:
C11H7BrN4O3S
Mol. Mass.:
355.167
SMILES:
[O-][N+](=O)c1ccc(\C=N/NC(=O)c2cncc(Br)c2)s1
: