Target
Lethal factor
Ligand
BDBM61118
Substrate
Meas. Tech.
High-throughput multiplex microsphere dose response for inhibitors of toxin protease, specifically Lethal Factor protease, compounds from Cherry Pick 01
EC50
>20000±n/a nM
Citation
 PubChem, PC High-throughput multiplex microsphere dose response for inhibitors of toxin protease, specifically Lethal Factor protease, compounds from Cherry Pick 01 PubChem Bioassay (2012)[AID] 
Target
Name:
Lethal factor
Synonyms:
Anthrax Lethal Factor (LF) Antrax lethal toxin lef | lethal factor
Type:
PROTEIN
Mol. Mass.:
93758.56
Organism:
Bacillus anthracis
Description:
ChEMBL_1460338
Residue:
809
  
Inhibitor
Name:
BDBM61118
Synonyms:
1-(2-Methoxy-phenyl)-3-(4-nitro-phenyl)-5-phenyl-4,5-dihydro-1H-pyrazole 2-(2-methoxyphenyl)-5-(4-nitrophenyl)-3-phenyl-3,4-dihydropyrazole SMR000515423 | cid_2865835
Type:
Small organic molecule
Emp. Form.:
C22H19N3O3
Mol. Mass.:
373.4046
SMILES:
COc1ccccc1[N+]1=N[C-](CC1c1ccccc1)c1ccc(cc1)[N+]([O-])=O
: