Target
Nuclear receptor coactivator 3
Ligand
BDBM87252
Substrate
Meas. Tech.
Counterscreen for inhibitors of the Steroid Receptor Coactivator 1 (SRC1; NCOA1)
IC50
1197±n/a nM
Citation
 PubChem, PC Counterscreen for inhibitors of the Steroid Receptor Coactivator 1 (SRC1; NCOA1): Luminescence-based cell-based high throughput dose response assay to identify inhibitors of the Steroid Receptor Coactivator 3 (SRC3; NCOA3) PubChem Bioassay (2012)[AID] 
Target
Name:
Nuclear receptor coactivator 3
Synonyms:
AIB1 NCOA3 RAC3 nuclear receptor coactivator 3 isoform a
Type:
Enzyme Catalytic Domain
Mol. Mass.:
155305.29
Organism:
Homo sapiens (Human)
Description:
Q9Y6Q9
Residue:
1424
  
Inhibitor
Name:
BDBM87252
Synonyms:
7-Cyclopropyl-8H-imidazo[4',5':3,4]benzo[1,2-c][1,2,5]thiadiazole MLS000030244 cid_647662
Type:
Small organic molecule
Emp. Form.:
C10H8N4S
Mol. Mass.:
216.262
SMILES:
C1CC1c1nc2ccc3[nH]snc3c2n1
: