Target
Nuclear receptor coactivator 1
Ligand
BDBM7493
Substrate
Meas. Tech.
Luminescence-based cell-based high throughput dose response assay for inhibitors of the Steroid Receptor Coactivator 1 (SRC1; NCOA1)
IC50
3715±n/a nM
Citation
 PubChem, PC Luminescence-based cell-based high throughput dose response assay for inhibitors of the Steroid Receptor Coactivator 1 (SRC1; NCOA1) PubChem Bioassay (2012)[AID] 
Target
Name:
Nuclear receptor coactivator 1
Synonyms:
BHLHE74 NCOA1 NCoA-1 Protein Hin-2 Renal carcinoma antigen NY-REN-52 SRC1 nuclear receptor coactivator 1 isoform 1
Type:
PROTEIN
Mol. Mass.:
156749.34
Organism:
Homo sapiens (Human)
Description:
ChEMBL_759690
Residue:
1441
  
Inhibitor
Name:
BDBM7493
Synonyms:
cid_23641117
Type:
Emp. Form.:
C20H25NO2
Mol. Mass.:
311.418
SMILES:
[H][C@@]12C[C@@]34C(=O)C(=C)[C@@]5([H])C[C@@]3([H])[C@@]3([H])N1C[C@]1(C)CCC[C@]3([C@]21[H])[C@]4([H])[C@@]5([H])O
: