Target
26S proteasome non-ATPase regulatory subunit 14
Ligand
BDBM39775
Substrate
Meas. Tech.
Dose response confirmation of uHTS RPN11 inhibitor hits in a Fluorescence Polarization assay
IC50
703±116 nM
Citation
 PubChem, PC Dose response confirmation of uHTS RPN11 inhibitor hits in a Fluorescence Polarization assay PubChem Bioassay (2012)[AID] 
Target
Name:
26S proteasome non-ATPase regulatory subunit 14
Synonyms:
26S Proteasome regulatory subunit Rpn11 (Rpn11) PSDE_HUMAN PSMD14 protein
Type:
Protein
Mol. Mass.:
34576.68
Organism:
Homo sapiens (Human)
Description:
O00487
Residue:
310
  
Inhibitor
Name:
BDBM39775
Synonyms:
(5E)-5-[(E)-3-[4-(dimethylamino)phenyl]prop-2-enylidene]-3-phenyl-2-sulfanylidene-1,3-thiazolidin-4-one (5E)-5-[(E)-3-[4-(dimethylamino)phenyl]prop-2-enylidene]-3-phenyl-2-thioxo-thiazolidin-4-one MLS000557712 cid_5752007
Type:
Small organic molecule
Emp. Form.:
C20H18N2OS2
Mol. Mass.:
366.5
SMILES:
CN(C)c1ccc(\C=C\C=C2\SC(=S)N(C2=O)c2ccccc2)cc1
: