Target
Prothrombin
Ligand
BDBM83506
Substrate
Meas. Tech.
Dose Response validation of uHTS RPN11 inhibitor hits using a Thrombin Fluorescence Polarization assay
IC50
148±17 nM
Citation
 PubChem, PC Dose Response validation of uHTS RPN11 inhibitor hits using a Thrombin Fluorescence Polarization assay PubChem Bioassay (2012)[AID] 
Target
Name:
Prothrombin
Synonyms:
Activation peptide fragment 1 Coagulation factor II Prothrombin Thrombin Thrombin light chain
Type:
Enzyme
Mol. Mass.:
70502.73
Organism:
Bos taurus (Bovine)
Description:
P00735
Residue:
625
  
Inhibitor
Name:
BDBM83506
Synonyms:
(5Z)-5-[[2-(3-isopropoxypropylamino)-4-keto-9-methyl-pyrido[1,2-a]pyrimidin-3-yl]methylene]-3-propyl-2-thioxo-thiazolidin-4-one (5Z)-5-[[9-methyl-4-oxo-2-(3-propan-2-yloxypropylamino)-3-pyrido[1,2-a]pyrimidinyl]methylidene]-3-propyl-2-sulfanylidene-4-thiazolidinone 2-(3-Isopropoxy-propylamino)-9-methyl-3-[4-oxo-3-propyl-2-thioxo-thiazolidin-(5Z)-ylidenemethyl]-pyrid o[1,2-a]pyrimidin-4-one SMR000147996 | cid_1880983
Type:
Small organic molecule
Emp. Form.:
C22H28N4O3S2
Mol. Mass.:
460.613
SMILES:
CCCN1C(=S)S\C(=C/c2c(NCCCOC(C)C)nc3c(C)cccn3c2=O)C1=O
: