Target
Mitochondrial import inner membrane translocase subunit TIM23
Ligand
BDBM89129
Substrate
Meas. Tech.
SAR analysis of small molecule inhibitors of tim23-1 yeast via a luminescent assay
IC50
459±n/a nM
Citation
 PubChem, PC SAR analysis of small molecule inhibitors of tim23-1 yeast via a luminescent assay PubChem Bioassay (2012)[AID] 
Target
Name:
Mitochondrial import inner membrane translocase subunit TIM23
Synonyms:
MAS6 MPI3 TIM23_YEAST | TPA: Essential component of the Translocase of the Inner Mitochondrial membrane (TIM23 complex)
Type:
Enzyme Catalytic Domain
Mol. Mass.:
23245.32
Organism:
Saccharomyces cerevisiae S288c
Description:
gi_285814664
Residue:
222
  
Inhibitor
Name:
BDBM89129
Synonyms:
MLS-0026991.0001 N-[2-(2-furyl)-3H-benzimidazol-5-yl]thiophene-2-carboxamide cid_828644
Type:
Small organic molecule
Emp. Form.:
C16H11N3O2S
Mol. Mass.:
309.342
SMILES:
O=C(Nc1ccc2nc([nH]c2c1)-c1ccco1)c1cccs1
: