Target
DNA (cytosine-5)-methyltransferase 1
Ligand
BDBM46225
Substrate
Meas. Tech.
Dose response confirmation of DNMT1 inhibitors in a Fluorescent Molecular Beacon assay
IC50
4120±125 nM
Citation
 PubChem, PC Dose response confirmation of DNMT1 inhibitors in a Fluorescent Molecular Beacon assay PubChem Bioassay (2012)[AID] 
Target
Name:
DNA (cytosine-5)-methyltransferase 1
Synonyms:
AIM CXXC9 DNA (cytosine-5)-methyltransferase 1 isoform b DNA methyltransferase HsaI DNMT1 M.HsaI | MCMT
Type:
Enzyme
Mol. Mass.:
183184.85
Organism:
Homo sapiens (Human)
Description:
P26358
Residue:
1616
  
Inhibitor
Name:
BDBM46225
Synonyms:
MLS-0266851.0001 | cid_2545467
Type:
Small organic molecule
Emp. Form.:
C23H18N2O7S2
Mol. Mass.:
498.528
SMILES:
CCOC(=O)c1sc2nc3c(SCC(O)=O)cc(cn3c(=O)c2c1C)C(=O)c1ccccc1O
: