Target
Zinc finger protein GLI1
Ligand
BDBM42452
Substrate
Meas. Tech.
Dose response confirmation of uHTS antagonist hits from Gli-SUFU in a luminescent reporter assay
IC50
1780±n/a nM
Citation
 PubChem, PC Dose response confirmation of uHTS antagonist hits from Gli-SUFU in a luminescent reporter assay PubChem Bioassay (2012)[AID] 
Target
Name:
Zinc finger protein GLI1
Synonyms:
GLI1_MOUSE Gli1 | Glioma-associated oncogene homolog
Type:
PROTEIN
Mol. Mass.:
118579.34
Organism:
Mus musculus
Description:
EBI_101259
Residue:
1111
  
Inhibitor
Name:
BDBM42452
Synonyms:
2-(4-chlorophenyl)-3-(4-methoxyphenyl)-4,5-dihydroimidazo[1,2-a]quinolin-10-ium;bromide SMR000354788 | cid_16195959
Type:
Small organic molecule
Emp. Form.:
C24H20ClN2O
Mol. Mass.:
387.881
SMILES:
COc1ccc(cc1)-n1c(c[n+]-2c1CCc1ccccc-21)-c1ccc(Cl)cc1
: