Target
Zinc finger protein GLI1
Ligand
BDBM64248
Substrate
Meas. Tech.
Dose response confirmation of uHTS antagonist hits from Gli-SUFU in a luminescent reporter assay
IC50
377±n/a nM
Citation
 PubChem, PC Dose response confirmation of uHTS antagonist hits from Gli-SUFU in a luminescent reporter assay PubChem Bioassay (2012)[AID] 
Target
Name:
Zinc finger protein GLI1
Synonyms:
GLI1_MOUSE Gli1 | Glioma-associated oncogene homolog
Type:
PROTEIN
Mol. Mass.:
118579.34
Organism:
Mus musculus
Description:
EBI_101259
Residue:
1111
  
Inhibitor
Name:
BDBM64248
Synonyms:
MLS001030720 N-cyclopropyl-2-[[2-(4-ethoxyphenyl)-5-methyl-1,3-oxazol-4-yl]methylsulfanyl]acetamide N-cyclopropyl-2-[[2-(4-ethoxyphenyl)-5-methyl-4-oxazolyl]methylthio]acetamide cid_4174238
Type:
Small organic molecule
Emp. Form.:
C18H22N2O3S
Mol. Mass.:
346.444
SMILES:
CCOc1ccc(cc1)-c1nc(CSCC(=O)NC2CC2)c(C)o1
: