Target
Apoptotic protease-activating factor 1
Ligand
BDBM84003
Substrate
Meas. Tech.
SAR analysis of small molecule Activators of Apaf-1 in a Fluorescent assay - set 2
EC50
8030±n/a nM
Citation
 PubChem, PC SAR analysis of small molecule Activators of Apaf-1 in a Fluorescent assay - set 2 PubChem Bioassay (2012)[AID] 
Target
Name:
Apoptotic protease-activating factor 1
Synonyms:
APAF1 Apoptotic peptidase activating factor 1 | KIAA0413
Type:
Enzyme Catalytic Domain
Mol. Mass.:
141834.40
Organism:
Homo sapiens (Human)
Description:
O14727
Residue:
1248
  
Inhibitor
Name:
BDBM84003
Synonyms:
3-(1H-indol-3-yl)-2-methyl-propanoic acid 3-(1H-indol-3-yl)-2-methylpropanoic acid SMR000387067 | cid_2772042
Type:
Small organic molecule
Emp. Form.:
C12H13NO2
Mol. Mass.:
203.2371
SMILES:
CC(Cc1c[nH]c2ccccc12)C(O)=O
: