Target
Apoptotic protease-activating factor 1
Ligand
BDBM89489
Substrate
Meas. Tech.
SAR analysis of small molecule Activators of Apaf-1 in a Fluorescent assay - set 2
EC50
12700±n/a nM
Citation
 PubChem, PC SAR analysis of small molecule Activators of Apaf-1 in a Fluorescent assay - set 2 PubChem Bioassay (2012)[AID] 
Target
Name:
Apoptotic protease-activating factor 1
Synonyms:
APAF1 Apoptotic peptidase activating factor 1 | KIAA0413
Type:
Enzyme Catalytic Domain
Mol. Mass.:
141834.40
Organism:
Homo sapiens (Human)
Description:
O14727
Residue:
1248
  
Inhibitor
Name:
BDBM89489
Synonyms:
3-(4-bromanyl-3,5-dimethyl-pyrazol-1-yl)-2-methyl-propanoic acid 3-(4-bromo-3,5-dimethyl-pyrazol-1-yl)-2-methyl-propionic acid MLS-0463286.0001 | cid_6457554
Type:
Small organic molecule
Emp. Form.:
C9H13BrN2O2
Mol. Mass.:
261.116
SMILES:
CC(Cn1nc(C)c(Br)c1C)C(O)=O
: