Target
Caspase-9
Ligand
BDBM50118591
Substrate
Meas. Tech.
SAR analysis of small molecule activators of Apaf-1 using a LZ-Caspase-9/Caspase-3 Fluorescent Selectivity assay - Set 2
EC50
>100000±n/a nM
Citation
 PubChem, PC SAR analysis of small molecule activators of Apaf-1 using a LZ-Caspase-9/Caspase-3 Fluorescent Selectivity assay - Set 2 PubChem Bioassay (2012)[AID] 
Target
Name:
Caspase-9
Synonyms:
Apoptotic protease-activating factor 1/Caspase-3/Caspase-9/Cytochrome c CASP-9 CASP9_HUMAN ICE-like apoptotic protease 6 caspase-9 isoform alpha preproprotein
Type:
Enzyme
Mol. Mass.:
46277.29
Organism:
Homo sapiens (Human)
Description:
Residue:
416
  
Inhibitor
Name:
BDBM50118591
Synonyms:
(R/S)-3-(4-Methoxy-phenyl)-4,5-dihydro-isoxazole-5-carboxylic acid cid_2978440
Type:
Small organic molecule
Emp. Form.:
C11H11NO4
Mol. Mass.:
221.2093
SMILES:
COc1ccc(cc1)C1=NOC(C1)C(O)=O
: