Target
Caspase-9
Ligand
BDBM89507
Substrate
Meas. Tech.
SAR analysis of small molecule activators of Apaf-1 using a LZ-Caspase-9/Caspase-3 Fluorescent Selectivity assay - Set 2
EC50
>100000±n/a nM
Citation
 PubChem, PC SAR analysis of small molecule activators of Apaf-1 using a LZ-Caspase-9/Caspase-3 Fluorescent Selectivity assay - Set 2 PubChem Bioassay (2012)[AID] 
Target
Name:
Caspase-9
Synonyms:
Apoptotic protease-activating factor 1/Caspase-3/Caspase-9/Cytochrome c CASP-9 CASP9_HUMAN ICE-like apoptotic protease 6 caspase-9 isoform alpha preproprotein
Type:
Enzyme
Mol. Mass.:
46277.29
Organism:
Homo sapiens (Human)
Description:
Residue:
416
  
Inhibitor
Name:
BDBM89507
Synonyms:
2-methyl-3-(1-pyrrolidinyl)propanoic acid 2-methyl-3-pyrrolidin-1-ylpropanoic acid MLS-0466818.0001 | cid_43538707
Type:
Small organic molecule
Emp. Form.:
C8H15NO2
Mol. Mass.:
157.2102
SMILES:
CC(CN1CCCC1)C(O)=O
: