Target
Corticotropin-releasing factor-binding protein
Ligand
BDBM91147
Substrate
Meas. Tech.
Dose Response confirmation of uHTS hits for small molecule agonists of the CRF-binding protein and CRF-R2 receptor complex
EC50
3220±n/a nM
Citation
 PubChem, PC Dose Response confirmation of uHTS hits for small molecule agonists of the CRF-binding protein and CRF-R2 receptor complex PubChem Bioassay (2012)[AID] 
Target
Name:
Corticotropin-releasing factor-binding protein
Synonyms:
CRFBP CRHBP_HUMAN | corticotropin releasing factor-binding protein
Type:
Enzyme Catalytic Domain
Mol. Mass.:
36143.95
Organism:
Homo sapiens (Human)
Description:
P24387
Residue:
322
  
Inhibitor
Name:
BDBM91147
Synonyms:
2-[[oxo-[4-(1-pyrrolidinylsulfonyl)phenyl]methyl]amino]-6-propyl-5,7-dihydro-4H-thieno[2,3-c]pyridine-3-carboxamide 6-propyl-2-[(4-pyrrolidin-1-ylsulfonylphenyl)carbonylamino]-5,7-dihydro-4H-thieno[2,3-c]pyridine-3-carboxamide MLS001238032 cid_5093184
Type:
Small organic molecule
Emp. Form.:
C22H28N4O4S2
Mol. Mass.:
476.612
SMILES:
CCCN1CCc2c(C1)sc(NC(=O)c1ccc(cc1)S(=O)(=O)N1CCCC1)c2C(N)=O
: