Target
Lethal factor
Ligand
BDBM91548
Substrate
Meas. Tech.
High-throughput multiplex microsphere dose response for inhibitors of toxin protease, specifically Lethal Factor protease, compounds from Powder Set 01
EC50
>20000±n/a nM
Citation
 PubChem, PC High-throughput multiplex microsphere dose response for inhibitors of toxin protease, specifically Lethal Factor protease, compounds from Powder Set 01 PubChem Bioassay (2012)[AID] 
Target
Name:
Lethal factor
Synonyms:
Anthrax Lethal Factor (LF) Antrax lethal toxin lef | lethal factor
Type:
PROTEIN
Mol. Mass.:
93758.56
Organism:
Bacillus anthracis
Description:
ChEMBL_1460338
Residue:
809
  
Inhibitor
Name:
BDBM91548
Synonyms:
3-(1,3-benzodioxol-5-yl)-2,5-diphenyl-3,4-dihydropyrazole VU0466993-1 | cid_2729175
Type:
Small organic molecule
Emp. Form.:
C22H18N2O2
Mol. Mass.:
342.3905
SMILES:
C1Oc2ccc(cc2O1)C1CC(=NN1c1ccccc1)c1ccccc1
: