Target
Lethal factor
Ligand
BDBM91551
Substrate
Meas. Tech.
High-throughput multiplex microsphere dose response for inhibitors of toxin protease, specifically Lethal Factor protease, compounds from Powder Set 01
EC50
>20000±n/a nM
Citation
 PubChem, PC High-throughput multiplex microsphere dose response for inhibitors of toxin protease, specifically Lethal Factor protease, compounds from Powder Set 01 PubChem Bioassay (2012)[AID] 
Target
Name:
Lethal factor
Synonyms:
Anthrax Lethal Factor (LF) Antrax lethal toxin lef | lethal factor
Type:
PROTEIN
Mol. Mass.:
93758.56
Organism:
Bacillus anthracis
Description:
ChEMBL_1460338
Residue:
809
  
Inhibitor
Name:
BDBM91551
Synonyms:
3-(4-chlorophenyl)-2,5-diphenyl-3,4-dihydropyrazole VU0466987-1 | cid_248777
Type:
Small organic molecule
Emp. Form.:
C21H17ClN2
Mol. Mass.:
332.826
SMILES:
Clc1ccc(cc1)C1CC(=NN1c1ccccc1)c1ccccc1
: