Target
Lethal factor
Ligand
BDBM91555
Substrate
Meas. Tech.
High-throughput multiplex microsphere dose response for inhibitors of toxin protease, specifically Lethal Factor protease, compounds from Powder Set 01
EC50
>20000±n/a nM
Citation
 PubChem, PC High-throughput multiplex microsphere dose response for inhibitors of toxin protease, specifically Lethal Factor protease, compounds from Powder Set 01 PubChem Bioassay (2012)[AID] 
Target
Name:
Lethal factor
Synonyms:
Anthrax Lethal Factor (LF) Antrax lethal toxin lef | lethal factor
Type:
PROTEIN
Mol. Mass.:
93758.56
Organism:
Bacillus anthracis
Description:
ChEMBL_1460338
Residue:
809
  
Inhibitor
Name:
BDBM91555
Synonyms:
4-methyl-2-[3-(3-methylphenyl)-5-thiophen-2-yl-3,4-dihydropyrazol-2-yl]-1,3-thiazole 4-methyl-2-[5-(m-tolyl)-3-(2-thienyl)-2-pyrazolin-1-yl]thiazole cid_16426092
Type:
Small organic molecule
Emp. Form.:
C18H17N3S2
Mol. Mass.:
339.478
SMILES:
Cc1csc(n1)N1N=C(CC1c1cccc(C)c1)c1cccs1
: