Target
Lethal factor
Ligand
BDBM91565
Substrate
Meas. Tech.
High-throughput multiplex microsphere dose response for inhibitors of toxin protease, specifically Lethal Factor protease, compounds from Powder Set 01
EC50
>20000±n/a nM
Citation
 PubChem, PC High-throughput multiplex microsphere dose response for inhibitors of toxin protease, specifically Lethal Factor protease, compounds from Powder Set 01 PubChem Bioassay (2012)[AID] 
Target
Name:
Lethal factor
Synonyms:
Anthrax Lethal Factor (LF) Antrax lethal toxin lef | lethal factor
Type:
PROTEIN
Mol. Mass.:
93758.56
Organism:
Bacillus anthracis
Description:
ChEMBL_1460338
Residue:
809
  
Inhibitor
Name:
BDBM91565
Synonyms:
N-(phenylmethyl)-2,3-dithiophen-2-yl-6-quinoxalinecarboxamide N-benzyl-2,3-bis(2-thienyl)quinoxaline-6-carboxamide VU0467050-1 | cid_3411472
Type:
Small organic molecule
Emp. Form.:
C24H17N3OS2
Mol. Mass.:
427.541
SMILES:
O=C(NCc1ccccc1)c1ccc2nc(-c3cccs3)c(nc2c1)-c1cccs1
: