Target
Lethal factor
Ligand
BDBM38452
Substrate
Meas. Tech.
High-throughput multiplex microsphere dose response for inhibitors of toxin protease, specifically Lethal Factor protease, compounds from Powder Set 01
EC50
7600±n/a nM
Citation
 PubChem, PC High-throughput multiplex microsphere dose response for inhibitors of toxin protease, specifically Lethal Factor protease, compounds from Powder Set 01 PubChem Bioassay (2012)[AID] 
Target
Name:
Lethal factor
Synonyms:
Anthrax Lethal Factor (LF) Antrax lethal toxin lef | lethal factor
Type:
PROTEIN
Mol. Mass.:
93758.56
Organism:
Bacillus anthracis
Description:
ChEMBL_1460338
Residue:
809
  
Inhibitor
Name:
BDBM38452
Synonyms:
MLS000050299 N-(2,3-dithiophen-2-yl-6-quinoxalinyl)-4-morpholinecarboxamide N-[2,3-bis(2-thienyl)quinoxalin-6-yl]morpholine-4-carboxamide cid_2214213
Type:
Small organic molecule
Emp. Form.:
C21H18N4O2S2
Mol. Mass.:
422.523
SMILES:
O=C(Nc1ccc2nc(-c3cccs3)c(nc2c1)-c1cccs1)N1CCOCC1
: