Target
Botulinum neurotoxin type F
Ligand
BDBM91558
Substrate
Meas. Tech.
High-throughput multiplex microsphere dose response for inhibitors of toxin protease, specifically Botulinum neurotoxin light chain F protease, compounds from Powder Set 01
EC50
>20000±n/a nM
Citation
 PubChem, PC High-throughput multiplex microsphere dose response for inhibitors of toxin protease, specifically Botulinum neurotoxin light chain F protease, compounds from Powder Set 01 PubChem Bioassay (2012)[AID] 
Target
Name:
Botulinum neurotoxin type F
Synonyms:
BXF_CLOBO botulinum neurotoxin type F, BoNT/F
Type:
Enzyme Catalytic Domain
Mol. Mass.:
146691.56
Organism:
Clostridium botulinum Bf
Description:
P30996
Residue:
1274
  
Inhibitor
Name:
BDBM91558
Synonyms:
(2,3-dithiophen-2-yl-6-quinoxalinyl)-(4-morpholinyl)methanone (2,3-dithiophen-2-ylquinoxalin-6-yl)-morpholin-4-ylmethanone [2,3-bis(2-thienyl)quinoxalin-6-yl]-morpholino-methanone | cid_3502585
Type:
Small organic molecule
Emp. Form.:
C21H17N3O2S2
Mol. Mass.:
407.509
SMILES:
O=C(N1CCOCC1)c1ccc2nc(-c3cccs3)c(nc2c1)-c1cccs1
: