Target
Botulinum neurotoxin type F
Ligand
BDBM47506
Substrate
Meas. Tech.
High-throughput multiplex microsphere dose response for inhibitors of toxin protease, specifically Botulinum neurotoxin light chain F protease, compounds from Powder Set 01
EC50
>20000±n/a nM
Citation
 PubChem, PC High-throughput multiplex microsphere dose response for inhibitors of toxin protease, specifically Botulinum neurotoxin light chain F protease, compounds from Powder Set 01 PubChem Bioassay (2012)[AID] 
Target
Name:
Botulinum neurotoxin type F
Synonyms:
BXF_CLOBO botulinum neurotoxin type F, BoNT/F
Type:
Enzyme Catalytic Domain
Mol. Mass.:
146691.56
Organism:
Clostridium botulinum Bf
Description:
P30996
Residue:
1274
  
Inhibitor
Name:
BDBM47506
Synonyms:
3-(4-Chloro-phenyl)-5-furan-2-yl-1-phenyl-4,5-dihydro-1H-pyrazole 5-(4-chlorophenyl)-3-(2-furanyl)-2-phenyl-3,4-dihydropyrazole MLS000768037 cid_2834912
Type:
Small organic molecule
Emp. Form.:
C19H15ClN2O
Mol. Mass.:
322.788
SMILES:
Clc1ccc(cc1)C1=NN(C(C1)c1ccco1)c1ccccc1
: