Target
Polyphenol oxidase 2
Ligand
BDBM50343137
Substrate
Meas. Tech.
Tyrosinase Assay
Temperature
303.15±0 K
Ki
46.4±0.0 nM
Citation
 Ryu, YBHa, TJCurtis-Long, MJRyu, HWGal, SWPark, KH Inhibitory effects on mushroom tyrosinase by flavones from the stem barks of Morus lhou (S.) Koidz. J Enzyme Inhib Med Chem 23:922-30 (2008)  
Target
Name:
Polyphenol oxidase 2
Synonyms:
Monophenol monooxygenase PPO2 Tyrosinase
Type:
Protein
Mol. Mass.:
63923.66
Organism:
Agaricus bisporus (Common mushroom)
Description:
O42713
Residue:
556
  
Inhibitor
Name:
BDBM50343137
Synonyms:
CHEMBL1770313 Cycolmorusin, 2
Type:
Small organic molecule
Emp. Form.:
C25H22O6
Mol. Mass.:
418.4386
SMILES:
[#6]\[#6](-[#6])=[#6]\[#6]-1-[#8]-c2cc(-[#8])ccc2-c2oc3c4-[#6]=[#6]C([#6])([#6])[#8]-c4cc(-[#8])c3c(=O)c12
: