Target
Neuronal acetylcholine receptor subunit alpha-7
Ligand
BDBM91594
Substrate
Meas. Tech.
Creating an a7 Nicotinic Acetylcholine Recognition Domain from the Acetylcholine-binding Protein
pH
7.4±n/a
Temperature
293.15±n/a K
EC50
92±n/a nM
Citation
 Nemecz, AkosTaylor, Palmer  Creating an a7 Nicotinic Acetylcholine Recognition Domain from the Acetylcholine-binding Protein Taylor Research Group 0:0 (2014)   
Target
Name:
Neuronal acetylcholine receptor subunit alpha-7
Synonyms:
ACHA7_HUMAN Cholinergic, Nicotinic Alpha7 Neuronal acetylcholine receptor protein alpha-7 subunit Nicotinic acetylcholine receptor alpha-7 (alpha7 nAChR)
Type:
Mol. Mass.:
56448.33
Organism:
Homo sapiens (Human)
Description:
CHRNA7 (NACHRA7)
Residue:
502
  
Inhibitor
Name:
BDBM91594
Synonyms:
Tropisetron
Type:
Emp. Form.:
C17H20N2O2
Mol. Mass.:
284.3529
SMILES:
[H]C12CC[C@@H](C[C@H](C1)OC(=O)c1c[nH]c3ccccc13)N2C
: