Target
Neuronal acetylcholine receptor subunit alpha-7
Ligand
BDBM91603
Substrate
Meas. Tech.
Synthesizing Selective Agonists for the ?7 Nicotinic Receptor with in situ Click-Chemistry on Acetylcholine Binding Protein Templates.
pH
7.4±n/a
Temperature
310.15±n/a K
EC50
600±n/a nM
Citation
 Yamauchi, JGGomez, KGrimster, NDufouil, MNemecz, AFotsing, JRHo, KTalley, TTSharpless, KFokin, VVTaylor, P Synthesizing Selective Agonists for the ?7 Nicotinic Receptor with in situ Click-Chemistry on Acetylcholine Binding Protein Templates. Mol Pharmacol 82:687-699 (2014)  
Target
Name:
Neuronal acetylcholine receptor subunit alpha-7
Synonyms:
ACHA7_HUMAN Cholinergic, Nicotinic Alpha7 Neuronal acetylcholine receptor protein alpha-7 subunit Nicotinic acetylcholine receptor alpha-7 (alpha7 nAChR)
Type:
Mol. Mass.:
56448.33
Organism:
Homo sapiens (Human)
Description:
CHRNA7 (NACHRA7)
Residue:
502
  
Inhibitor
Name:
BDBM91603
Synonyms:
4' | alpha7 agonists 4'
Type:
Emp. Form.:
C22H30N5O
Mol. Mass.:
380.506
SMILES:
CN1CC=C(OCc2cnnn2C2CC3CCC(C2)[N+]3(C)C)c2ccccc12
: