Target
Acetylcholine-binding protein
Ligand
BDBM91599
Substrate
Meas. Tech.
Synthesizing Selective Agonists for the ?7 Nicotinic Receptor with in situ Click-Chemistry on Acetylcholine Binding Protein Templates.
pH
7.4±n/a
Temperature
293.15±n/a K
Ki
40±n/a nM
Citation
 Yamauchi, JGGomez, KGrimster, NDufouil, MNemecz, AFotsing, JRHo, KTalley, TTSharpless, KFokin, VVTaylor, P Synthesizing Selective Agonists for the ?7 Nicotinic Receptor with in situ Click-Chemistry on Acetylcholine Binding Protein Templates. Mol Pharmacol 82:687-699 (2014)  
Target
Name:
Acetylcholine-binding protein
Synonyms:
ACHP_LYMST Acetylcholine Binding protein Acetylcholine-binding protein (Ls-AchBP) | AchBP
Type:
Mol. Mass.:
26055.52
Organism:
Lymnaea stagnalis
Description:
Soluble acetylcholine receptor
Residue:
229
  
Inhibitor
Name:
BDBM91599
Synonyms:
2' | alpha7 agonists 2'
Type:
Emp. Form.:
C20H28N5O2
Mol. Mass.:
370.4681
SMILES:
CCC[N+](C)(C)CCn1nncc1COc1cc(=O)n(C)c2ccccc12
: