Target
Soluble acetylcholine receptor
Ligand
BDBM91613
Substrate
Meas. Tech.
Synthesizing Selective Agonists for the ?7 Nicotinic Receptor with in situ Click-Chemistry on Acetylcholine Binding Protein Templates.
pH
7.4±n/a
Temperature
293.15±n/a K
Ki
120±n/a nM
Citation
 Yamauchi, JGGomez, KGrimster, NDufouil, MNemecz, AFotsing, JRHo, KTalley, TTSharpless, KFokin, VVTaylor, P Synthesizing Selective Agonists for the ?7 Nicotinic Receptor with in situ Click-Chemistry on Acetylcholine Binding Protein Templates. Mol Pharmacol 82:687-699 (2014)  
Target
Name:
Soluble acetylcholine receptor
Synonyms:
Acetylcholine Binding protein | Soluble acetylcholine receptor
Type:
Mol. Mass.:
26560.08
Organism:
Aplysia Californica
Description:
Q8WSF8
Residue:
236
  
Inhibitor
Name:
BDBM91613
Synonyms:
13q | alpha7 agonists 13q
Type:
Emp. Form.:
C20H27N4O3
Mol. Mass.:
371.4528
SMILES:
COc1ccc(C=O)c(OCc2cn(nn2)[C@H]2C[C@@H]3CC[C@H](C2)[N+]3(C)C)c1
: