Target
Soluble acetylcholine receptor
Ligand
BDBM91618
Substrate
Meas. Tech.
Synthesizing Selective Agonists for the ?7 Nicotinic Receptor with in situ Click-Chemistry on Acetylcholine Binding Protein Templates.
pH
7.4±n/a
Temperature
293.15±n/a K
Ki
270±n/a nM
Citation
 Yamauchi, JGGomez, KGrimster, NDufouil, MNemecz, AFotsing, JRHo, KTalley, TTSharpless, KFokin, VVTaylor, P Synthesizing Selective Agonists for the ?7 Nicotinic Receptor with in situ Click-Chemistry on Acetylcholine Binding Protein Templates. Mol Pharmacol 82:687-699 (2014)  
Target
Name:
Soluble acetylcholine receptor
Synonyms:
Acetylcholine Binding protein | Soluble acetylcholine receptor
Type:
Mol. Mass.:
26560.08
Organism:
Aplysia Californica
Description:
Q8WSF8
Residue:
236
  
Inhibitor
Name:
BDBM91618
Synonyms:
18q | alpha7 agonists 18q
Type:
Emp. Form.:
C23H33N4O
Mol. Mass.:
381.5338
SMILES:
C[N+]1(C)[C@H]2CC[C@@H]1C[C@H](C2)n1cc(COc2ccccc2C2CCCC2)nn1
: