Target
Soluble acetylcholine receptor
Ligand
BDBM91620
Substrate
Meas. Tech.
Synthesizing Selective Agonists for the ?7 Nicotinic Receptor with in situ Click-Chemistry on Acetylcholine Binding Protein Templates.
pH
7.4±n/a
Temperature
293.15±n/a K
Ki
120±n/a nM
Citation
 Yamauchi, JGGomez, KGrimster, NDufouil, MNemecz, AFotsing, JRHo, KTalley, TTSharpless, KFokin, VVTaylor, P Synthesizing Selective Agonists for the ?7 Nicotinic Receptor with in situ Click-Chemistry on Acetylcholine Binding Protein Templates. Mol Pharmacol 82:687-699 (2014)  
Target
Name:
Soluble acetylcholine receptor
Synonyms:
Acetylcholine Binding protein | Soluble acetylcholine receptor
Type:
Mol. Mass.:
26560.08
Organism:
Aplysia Californica
Description:
Q8WSF8
Residue:
236
  
Inhibitor
Name:
BDBM91620
Synonyms:
20q | alpha7 agonists 20q
Type:
Emp. Form.:
C24H27N4O
Mol. Mass.:
387.4968
SMILES:
C[N+]1(C)[C@H]2CC[C@@H]1C[C@H](C2)n1cc(nn1)C1(O)c2ccccc2-c2ccccc12
: