Target
Carbonic anhydrase 2
Ligand
BDBM91709
Substrate
Meas. Tech.
Inhibition Assay
Ki
64±0.0 nM
Citation
 Morsy, SMBadawi, AMCecchi, AScozzafava, ASupuran, CT Carbonic anhydrase inhibitors. Biphenylsulfonamides with inhibitory action towards the transmembrane, tumor-associated isozymes IX possess cytotoxic activity against human colon, lung and breast cancer cell lines. J Enzyme Inhib Med Chem 24:499-505 (2009)  
Target
Name:
Carbonic anhydrase 2
Synonyms:
CA-II CAC Carbonate dehydratase II Carbonic anhydrase 2 (CA-II) Carbonic anhydrase C Carbonic anhydrase II (CA-II) Carbonic anhydrase II (hCA II) | Carbonic anhydrase isoenzyme II (hCA II)
Type:
Enzyme
Mol. Mass.:
29250.71
Organism:
Homo sapiens (Human)
Description:
P00918
Residue:
260
  
Inhibitor
Name:
BDBM91709
Synonyms:
Sulfonamide, 11
Type:
Small organic molecule
Emp. Form.:
C24H22N4O8S4
Mol. Mass.:
622.713
SMILES:
NS(=O)(=O)c1ccc(NS(=O)(=O)c2ccc(cc2)-c2ccc(cc2)S(=O)(=O)Nc2ccc(cc2)S(N)(=O)=O)cc1
: